Reaction Details
TargetMu-type opioid receptor
LigandBDBM50102831
Substrate/Competitorn/a
Meas. Tech.ChEMBL_1432427 (CHEMBL3385150)
Ki 0.240000±n/a nM
Citation Watanabe, YKitazawa, SFujii, HNemoto, THirayama, SIwai, TGouda, HHirono, SNagasea, H Design, synthesis, and structure-activity relationship of novel opioid¿ receptor selective agonists:a-iminoamide derivatives with an azabicyclo[2.2.2]octene skeleton. Bioorg Med Chem Lett24:4980-3 (2014) 
 
Mu-type opioid receptor
Name:Mu-type opioid receptor
Type:Enzyme Catalytic Domain
Mol. Mass.:44431.62
Organism:MOUSE
Description:OPIATE Mu OPRM1 MOUSE::P42866
Residue:398
BDBM50102831
NameBDBM50102831
Synonyms:CHEMBL3339380
TypeSmall organic molecule
Emp. Form.C29H33N3O4
Mol. Mass.487.59
SMILESOc1ccc2CC3N(CC4CC4)CCC45C(Oc1c24)[C@@]1(O)CC[C@@]35N[C@@H]1C(=O)NCc1ccccc1