Reaction Details
TargetKappa-type opioid receptor
LigandBDBM50102832
Substrate/Competitorn/a
Meas. Tech.ChEMBL_1433276 (CHEMBL3388814)
EC50 0.180000±n/a nM
Citation Watanabe, YKitazawa, SFujii, HNemoto, THirayama, SIwai, TGouda, HHirono, SNagasea, H Design, synthesis, and structure-activity relationship of novel opioid¿ receptor selective agonists:a-iminoamide derivatives with an azabicyclo[2.2.2]octene skeleton. Bioorg Med Chem Lett24:4980-3 (2014) 
 
Kappa-type opioid receptor
Name:Kappa-type opioid receptor
Type:G Protein-Coupled Receptor (GPCR)
Mol. Mass.:42648.76
Organism:Homo sapiens (Human)
Description:P41145
Residue:380
BDBM50102832
NameBDBM50102832
Synonyms:CHEMBL3339379
TypeSmall organic molecule
Emp. Form.C30H33N3O4
Mol. Mass.499.6007
SMILESOc1ccc2CC3N(CC4CC4)CCC45C(Oc1c24)[C@@]1(O)CC[C@@]35N=C1C(=O)NCCc1ccccc1