Reaction Details
TargetNociceptin receptor
LigandBDBM50103533
Substrate/Competitorn/a
Meas. Tech.ChEMBL_1433291 (CHEMBL3389398)
IC50 0.033000±n/a nM
Citation Inamine, SNishimura, HLi, JIsozaki, KMatsushima, ACosta, TShimohigashi, Y Tritium-labelled isovaleryl-RYYRIK-NH2 as potential antagonist probe for ORL1 nociceptin receptor. Bioorg Med Chem22:5902-9 (2014) 
 
Nociceptin receptor
Name:Nociceptin receptor
Type:G Protein-Coupled Receptor (GPCR)
Mol. Mass.:40702.87
Organism:Homo sapiens (Human)
Description:P41146
Residue:370
BDBM50103533
NameBDBM50103533
Synonyms:CHEMBL3343947
TypeSmall organic molecule
Emp. Form.C47H76N14O9
Mol. Mass.981.1947
SMILESCC[C@H](C)[C@H](NC(=O)[C@H](CCCNC(N)=N)NC(=O)[C@H](Cc1ccc(O)cc1)NC(=O)[C@H](Cc1ccc(O)cc1)NC(=O)[C@H](CCCNC(N)=N)NC(=O)CC(C)C)C(=O)N[C@@H](CCCCN)C(N)=O