Reaction Details
TargetMitogen-activated protein kinase 14
LigandBDBM50102911
Substrate/Competitorn/a
Meas. Tech.ChEMBL_1461215 (CHEMBL3395778)
IC50 39±n/a nM
Citation Muth, FGünther, MBauer, SMDöring, EFischer, SMaier, JDrückes, PKöppler, JTrappe, JRothbauer, UKoch, PLaufer, SA Tetra-substituted pyridinylimidazoles as dual inhibitors of p38a mitogen-activated protein kinase and c-Jun N-terminal kinase 3 for potential treatment of neurodegenerative diseases. J Med Chem58:443-56 (2015) 
 
Mitogen-activated protein kinase 14
Name:Mitogen-activated protein kinase 14
Type:Serine/threonine-protein kinase
Mol. Mass.:41286.76
Organism:Homo sapiens (Human)
Description:Q16539
Residue:360
BDBM50102911
NameBDBM50102911
Synonyms:CHEMBL3394107
TypeSmall organic molecule
Emp. Form.C26H27FN4O3S
Mol. Mass.494.581
SMILESCC(=O)Nc1cc(ccn1)-c1c(nc(S\C=C/C(O)=O)n1CC1CCCCC1)-c1ccc(F)cc1