Reaction Details
TargetSolute carrier family 22 member 8
LigandBDBM50103523
Substrate/Competitorn/a
Meas. Tech.ChEMBL_1482571 (CHEMBL3537392)
IC50 116000±n/a nM
Citation Wolman, ATGionfriddo, MRHeindel, GAMukhija, PWitkowski, SBommareddy, AVanwert, AL Organic anion transporter 3 interacts selectively with lipophilicß-lactam antibiotics. Drug Metab Dispos41:791-800 (2013) 
 
Solute carrier family 22 member 8
Name:Solute carrier family 22 member 8
Type:PROTEIN
Mol. Mass.:59254.18
Organism:Mus musculus
Description:ChEMBL_104613
Residue:537
BDBM50103523
NameBDBM50103523
Synonyms:CHEBI:6827 Meticillin | Staphcillin
TypeSmall organic molecule
Emp. Form.C17H20N2O6S
Mol. Mass.380.415
SMILES[H][C@@]1(NC(=O)c2c(OC)cccc2OC)C(=O)N2[C@@H](C(O)=O)C(C)(C)S[C@]12[H]