Reaction Details
TargetSolute carrier family 22 member 8
LigandBDBM50350483
Substrate/Competitorn/a
Meas. Tech.ChEMBL_1482571 (CHEMBL3537392)
IC50 35000±n/a nM
Citation Wolman, ATGionfriddo, MRHeindel, GAMukhija, PWitkowski, SBommareddy, AVanwert, AL Organic anion transporter 3 interacts selectively with lipophilicß-lactam antibiotics. Drug Metab Dispos41:791-800 (2013) 
 
Solute carrier family 22 member 8
Name:Solute carrier family 22 member 8
Type:PROTEIN
Mol. Mass.:59254.18
Organism:Mus musculus
Description:ChEMBL_104613
Residue:537
BDBM50350483
NameBDBM50350483
Synonyms:Bactocill | OXACILLIN
TypeSmall organic molecule
Emp. Form.C19H19N3O5S
Mol. Mass.401.436
SMILESCc1onc(c1C(=O)N[C@H]1[C@H]2SC(C)(C)[C@@H](N2C1=O)C(O)=O)-c1ccccc1