Reaction Details
Target6-phosphofructo-2-kinase/fructose-2,6-bisphosphatase 3
LigandBDBM50445944
Substrate/Competitorn/a
Meas. Tech.ChEMBL_1435600 (CHEMBL3386523)
IC50 7400±n/a nM
Citation Granchi, CFancelli, DMinutolo, F An update on therapeutic opportunities offered by cancer glycolytic metabolism. Bioorg Med Chem Lett24:4915-25 (2014) 
 
6-phosphofructo-2-kinase/fructose-2,6-bisphosphatase 3
Name:6-phosphofructo-2-kinase/fructose-2,6-bisphosphatase 3
Type:Enzyme
Mol. Mass.:59620.59
Organism:Homo sapiens (Human)
Description:Q16875
Residue:520
BDBM50445944
NameBDBM50445944
Synonyms:CHEMBL3105839
TypeSmall organic molecule
Emp. Form.C15H12BrN5O2
Mol. Mass.374.192
SMILESCC(=O)c1nnn(c1C)-c1cnn(-c2ccccc2)c(=O)c1Br