Reaction Details
Target6-phosphofructo-2-kinase/fructose-2,6-bisphosphatase 3
LigandBDBM50445948
Substrate/Competitorn/a
Meas. Tech.ChEMBL_1435600 (CHEMBL3386523)
IC50 22900±n/a nM
Citation Granchi, CFancelli, DMinutolo, F An update on therapeutic opportunities offered by cancer glycolytic metabolism. Bioorg Med Chem Lett24:4915-25 (2014) 
 
6-phosphofructo-2-kinase/fructose-2,6-bisphosphatase 3
Name:6-phosphofructo-2-kinase/fructose-2,6-bisphosphatase 3
Type:Enzyme
Mol. Mass.:59620.59
Organism:Homo sapiens (Human)
Description:Q16875
Residue:520
BDBM50445948
NameBDBM50445948
Synonyms:CHEMBL3105848
TypeSmall organic molecule
Emp. Form.C13H10N2O
Mol. Mass.210.2313
SMILESO=C(\C=C\c1cccnc1)c1ccncc1