Reaction Details
TargetL-lactate dehydrogenase A chain
LigandBDBM50103569
Substrate/Competitorn/a
Meas. Tech.ChEMBL_1435605 (CHEMBL3386528)
Ki 37800±n/a nM
Citation Granchi, CFancelli, DMinutolo, F An update on therapeutic opportunities offered by cancer glycolytic metabolism. Bioorg Med Chem Lett24:4915-25 (2014) 
 
L-lactate dehydrogenase A chain
Name:L-lactate dehydrogenase A chain
Type:Protein
Mol. Mass.:36694.85
Organism:Homo sapiens (Human)
Description:P00338::PDB Code: 4ajp
Residue:332
BDBM50103569
NameBDBM50103569
Synonyms:CHEMBL3335795
TypeSmall organic molecule
Emp. Form.C23H22F3NO8
Mol. Mass.497.4179
SMILESCOC(=O)c1cc2c(cc(cc2n1O[C@@H]1O[C@H](CO)[C@@H](O)[C@H](O)[C@H]1O)-c1ccccc1)C(F)(F)F