Reaction Details
TargetAlpha-1A adrenergic receptor
LigandBDBM50103889
Substrate/Competitorn/a
Meas. Tech.ChEMBL_1436282 (CHEMBL3387782)
Ki 7.4±n/a nM
Citation Chen, JCampbell, APUrmi, KFWakelin, LPDenny, WAGriffith, RFinch, AM Human alpha1-adrenoceptor subtype selectivity of substituted homobivalent 4-aminoquinolines. Bioorg Med Chem22:5910-6 (2014) 
 
Alpha-1A adrenergic receptor
Name:Alpha-1A adrenergic receptor
Type:Cell-surface receptors
Mol. Mass.:51511.67
Organism:Homo sapiens (Human)
Description:P35348
Residue:466
BDBM50103889
NameBDBM50103889
Synonyms:CHEMBL3343979
TypeSmall organic molecule
Emp. Form.C22H22N4
Mol. Mass.342.4369
SMILESCc1cccc2c(NCCNc3ccnc4c(C)cccc34)ccnc12