Reaction Details
TargetAlpha-1A adrenergic receptor
LigandBDBM50103893
Substrate/Competitorn/a
Meas. Tech.ChEMBL_1436282 (CHEMBL3387782)
Ki 112±n/a nM
Citation Chen, JCampbell, APUrmi, KFWakelin, LPDenny, WAGriffith, RFinch, AM Human alpha1-adrenoceptor subtype selectivity of substituted homobivalent 4-aminoquinolines. Bioorg Med Chem22:5910-6 (2014) 
 
Alpha-1A adrenergic receptor
Name:Alpha-1A adrenergic receptor
Type:Cell-surface receptors
Mol. Mass.:51511.67
Organism:Homo sapiens (Human)
Description:P35348
Residue:466
BDBM50103893
NameBDBM50103893
Synonyms:CHEMBL3343982
TypeSmall organic molecule
Emp. Form.C27H32N4
Mol. Mass.412.5698
SMILESCc1ccc2c(NCCCCCCCNc3ccnc4cc(C)ccc34)ccnc2c1