Reaction Details
TargetAlpha-1A adrenergic receptor
LigandBDBM50103895
Substrate/Competitorn/a
Meas. Tech.ChEMBL_1436282 (CHEMBL3387782)
Ki 74±n/a nM
Citation Chen, JCampbell, APUrmi, KFWakelin, LPDenny, WAGriffith, RFinch, AM Human alpha1-adrenoceptor subtype selectivity of substituted homobivalent 4-aminoquinolines. Bioorg Med Chem22:5910-6 (2014) 
 
Alpha-1A adrenergic receptor
Name:Alpha-1A adrenergic receptor
Type:Cell-surface receptors
Mol. Mass.:51511.67
Organism:Homo sapiens (Human)
Description:P35348
Residue:466
BDBM50103895
NameBDBM50103895
Synonyms:CHEMBL3343984
TypeSmall organic molecule
Emp. Form.C27H32N4O2
Mol. Mass.444.5686
SMILESCOc1cccc2c(NCCCCCCCNc3ccnc4c(OC)cccc34)ccnc12