Reaction Details
TargetAlpha-1A adrenergic receptor
LigandBDBM50103887
Substrate/Competitorn/a
Meas. Tech.ChEMBL_1436283 (CHEMBL3387783)
Ki 120±n/a nM
Citation Chen, JCampbell, APUrmi, KFWakelin, LPDenny, WAGriffith, RFinch, AM Human alpha1-adrenoceptor subtype selectivity of substituted homobivalent 4-aminoquinolines. Bioorg Med Chem22:5910-6 (2014) 
 
Alpha-1A adrenergic receptor
Name:Alpha-1A adrenergic receptor
Type:Cell-surface receptors
Mol. Mass.:51511.67
Organism:Homo sapiens (Human)
Description:P35348
Residue:466
BDBM50103887
NameBDBM50103887
Synonyms:CHEMBL3343977
TypeSmall organic molecule
Emp. Form.C22H22N4
Mol. Mass.342.4369
SMILESCc1ccc2c(NCCNc3ccnc4cc(C)ccc34)ccnc2c1