Reaction Details
TargetAlpha-1B adrenergic receptor
LigandBDBM50103887
Substrate/Competitorn/a
Meas. Tech.ChEMBL_1436284 (CHEMBL3387784)
Ki 48±n/a nM
Citation Chen, JCampbell, APUrmi, KFWakelin, LPDenny, WAGriffith, RFinch, AM Human alpha1-adrenoceptor subtype selectivity of substituted homobivalent 4-aminoquinolines. Bioorg Med Chem22:5910-6 (2014) 
 
Alpha-1B adrenergic receptor
Name:Alpha-1B adrenergic receptor
Type:Enzyme
Mol. Mass.:56862.13
Organism:Homo sapiens (Human)
Description:P35368
Residue:520
BDBM50103887
NameBDBM50103887
Synonyms:CHEMBL3343977
TypeSmall organic molecule
Emp. Form.C22H22N4
Mol. Mass.342.4369
SMILESCc1ccc2c(NCCNc3ccnc4cc(C)ccc34)ccnc2c1