Reaction Details
TargetAlpha-1B adrenergic receptor
LigandBDBM50103889
Substrate/Competitorn/a
Meas. Tech.ChEMBL_1436284 (CHEMBL3387784)
Ki 40±n/a nM
Citation Chen, JCampbell, APUrmi, KFWakelin, LPDenny, WAGriffith, RFinch, AM Human alpha1-adrenoceptor subtype selectivity of substituted homobivalent 4-aminoquinolines. Bioorg Med Chem22:5910-6 (2014) 
 
Alpha-1B adrenergic receptor
Name:Alpha-1B adrenergic receptor
Type:Enzyme
Mol. Mass.:56862.13
Organism:Homo sapiens (Human)
Description:P35368
Residue:520
BDBM50103889
NameBDBM50103889
Synonyms:CHEMBL3343979
TypeSmall organic molecule
Emp. Form.C22H22N4
Mol. Mass.342.4369
SMILESCc1cccc2c(NCCNc3ccnc4c(C)cccc34)ccnc12