Reaction Details
TargetAlpha-1B adrenergic receptor
LigandBDBM50103891
Substrate/Competitorn/a
Meas. Tech.ChEMBL_1436284 (CHEMBL3387784)
Ki 151±n/a nM
Citation Chen, JCampbell, APUrmi, KFWakelin, LPDenny, WAGriffith, RFinch, AM Human alpha1-adrenoceptor subtype selectivity of substituted homobivalent 4-aminoquinolines. Bioorg Med Chem22:5910-6 (2014) 
 
Alpha-1B adrenergic receptor
Name:Alpha-1B adrenergic receptor
Type:Enzyme
Mol. Mass.:56862.13
Organism:Homo sapiens (Human)
Description:P35368
Residue:520
BDBM50103891
NameBDBM50103891
Synonyms:CHEMBL3343980
TypeSmall organic molecule
Emp. Form.C27H32N4
Mol. Mass.412.5698
SMILESCc1ccc2nccc(NCCCCCCCNc3ccnc4ccc(C)cc34)c2c1