Reaction Details
TargetAlpha-1D adrenergic receptor
LigandBDBM50103888
Substrate/Competitorn/a
Meas. Tech.ChEMBL_1436287 (CHEMBL3387787)
Ki 214±n/a nM
Citation Chen, JCampbell, APUrmi, KFWakelin, LPDenny, WAGriffith, RFinch, AM Human alpha1-adrenoceptor subtype selectivity of substituted homobivalent 4-aminoquinolines. Bioorg Med Chem22:5910-6 (2014) 
 
Alpha-1D adrenergic receptor
Name:Alpha-1D adrenergic receptor
Type:Enzyme Catalytic Domain
Mol. Mass.:60485.82
Organism:Homo sapiens (Human)
Description:adrenergic Alpha1D ADRA1D HUMAN::P25100
Residue:572
BDBM50103888
NameBDBM50103888
Synonyms:CHEMBL3343978
TypeSmall organic molecule
Emp. Form.C22H22N4O2
Mol. Mass.374.4357
SMILESCOc1ccc2c(NCCNc3ccnc4cc(OC)ccc34)ccnc2c1