Reaction Details
TargetAlbumin
LigandBDBM50027886
Substrate/Competitorn/a
Meas. Tech.ChEMBL_1486769 (CHEMBL3534721)
Kd 7970±n/a nM
Citation Longhi, RCorbioli, SFontana, SVinco, FBraggio, SHelmdach, LSchiller, JBoriss, H Brain tissue binding of drugs: evaluation and validation of solid supported porcine brain membrane vesicles (TRANSIL) as a novel high-throughput method. Drug Metab Dispos39:312-21 (2011) 
 
Albumin
Name:Albumin
Type:PROTEIN
Mol. Mass.:68729.59
Organism:Rattus norvegicus
Description:ChEMBL_1486769
Residue:608
BDBM50027886
NameBDBM50027886
Synonyms:1-Butyl-3-(p-methylphenylsulfonyl)urea 1-Butyl-3-tosylurea N-(4-Methylphenylsulfonyl)-N'-butylurea N-Butyl-N'-(p-tolylsulfonyl)urea N-n-Butyl-N'-tosylurea TOLBUTAMIDE
TypeSmall organic molecule
Emp. Form.C12H18N2O3S
Mol. Mass.270.348
SMILESCCCCNC(=O)NS(=O)(=O)c1ccc(C)cc1