Reaction Details
TargetAlbumin
LigandBDBM50009859
Substrate/Competitorn/a
Meas. Tech.ChEMBL_1486769 (CHEMBL3534721)
Kd 1470±n/a nM
Citation Longhi, RCorbioli, SFontana, SVinco, FBraggio, SHelmdach, LSchiller, JBoriss, H Brain tissue binding of drugs: evaluation and validation of solid supported porcine brain membrane vesicles (TRANSIL) as a novel high-throughput method. Drug Metab Dispos39:312-21 (2011) 
 
Albumin
Name:Albumin
Type:PROTEIN
Mol. Mass.:68729.59
Organism:Rattus norvegicus
Description:ChEMBL_1486769
Residue:608
BDBM50009859
NameBDBM50009859
Synonyms:(+-)-2-(p-isobutylphenyl)propionic acid (+-)-ibuprofen (4-isobutylphenyl)-alpha-methylacetic acid 2-(4-isobutylphenyl)propanoic acid 4-isobutylhydratropic acid Brufen IBUPROFEN LYSINE Ibuprofen (1) alpha-(4-isobutylphenyl)propionic acid | alpha-(p-isobutylphenyl)propionic acid
TypeSmall organic molecule
Emp. Form.C13H18O2
Mol. Mass.206.2808
SMILESCC(C)Cc1ccc(cc1)C(C)C(O)=O