Reaction Details
TargetRetinol-binding protein 4
LigandBDBM50104179
Substrate/Competitorn/a
Meas. Tech.ChEMBL_1505277 (CHEMBL3594967)
IC50 4.1±n/a nM
Citation Cioffi, CLRacz, BFreeman, EEConlon, MPChen, PStafford, DGSchwarz, DMZhu, LKitchen, DBBarnes, KDDobri, NMichelotti, ECywin, CLMartin, WHPearson, PGJohnson, GPetrukhin, K Bicyclic [3.3.0]-Octahydrocyclopenta[c]pyrrolo Antagonists of Retinol Binding Protein 4: Potential Treatment of Atrophic Age-Related Macular Degeneration and Stargardt Disease. J Med Chem58:5863-88 (2015) 
 
Retinol-binding protein 4
Name:Retinol-binding protein 4
Type:Protein
Mol. Mass.:23008.75
Organism:Homo sapiens (Human)
Description:P02753
Residue:201
BDBM50104179
NameBDBM50104179
Synonyms:CHEMBL3594225
TypeSmall organic molecule
Emp. Form.C19H20F3N3O2
Mol. Mass.379.3762
SMILESCOC(=O)c1cc(C)nc(n1)N1CCC(CC1)c1ccccc1C(F)(F)F