Reaction Details
TargetRetinol-binding protein 4
LigandBDBM50104147
Substrate/Competitorn/a
Meas. Tech.ChEMBL_1505278 (CHEMBL3594968)
IC50 248±n/a nM
Citation Cioffi, CLRacz, BFreeman, EEConlon, MPChen, PStafford, DGSchwarz, DMZhu, LKitchen, DBBarnes, KDDobri, NMichelotti, ECywin, CLMartin, WHPearson, PGJohnson, GPetrukhin, K Bicyclic [3.3.0]-Octahydrocyclopenta[c]pyrrolo Antagonists of Retinol Binding Protein 4: Potential Treatment of Atrophic Age-Related Macular Degeneration and Stargardt Disease. J Med Chem58:5863-88 (2015) 
 
Retinol-binding protein 4
Name:Retinol-binding protein 4
Type:Protein
Mol. Mass.:23008.75
Organism:Homo sapiens (Human)
Description:P02753
Residue:201
BDBM50104147
NameBDBM50104147
Synonyms:CHEMBL3593524
TypeSmall organic molecule
Emp. Form.C20H21F3N4O
Mol. Mass.390.4021
SMILES[H][C@@]12C[C@@H](C[C@]1([H])CN(C2)c1nc(C)cc(n1)C(N)=O)c1ccccc1C(F)(F)F