Reaction Details
TargetProtein mono-ADP-ribosyltransferase PARP4
LigandBDBM50104286
Substrate/Competitorn/a
Meas. Tech.ChEMBL_1505401 (CHEMBL3595284)
IC50 33000±n/a nM
Citation Nkizinkiko, YSuneel Kumar, BVJeankumar, VUHaikarainen, TKoivunen, JMadhuri, CYogeeswari, PVenkannagari, HObaji, EPihlajaniemi, TSriram, DLehtiö, L Discovery of potent and selective nonplanar tankyrase inhibiting nicotinamide mimics. Bioorg Med Chem23:4139-49 (2015) 
 
Protein mono-ADP-ribosyltransferase PARP4
Name:Protein mono-ADP-ribosyltransferase PARP4
Type:n/a
Mol. Mass.:192563.23
Organism:Homo sapiens (Human)
Description:Q9UKK3
Residue:1724
BDBM50104286
NameBDBM50104286
Synonyms:CHEMBL3593715
TypeSmall organic molecule
Emp. Form.C18H23N5O
Mol. Mass.325.4081
SMILESO=c1[nH]c(nc2CCCCc12)N1CCN(Cc2ccncc2)CC1