Reaction Details
TargetProtein mono-ADP-ribosyltransferase PARP10
LigandBDBM50104288
Substrate/Competitorn/a
Meas. Tech.ChEMBL_1505405 (CHEMBL3595288)
IC50>10000±n/a nM
Citation Nkizinkiko, YSuneel Kumar, BVJeankumar, VUHaikarainen, TKoivunen, JMadhuri, CYogeeswari, PVenkannagari, HObaji, EPihlajaniemi, TSriram, DLehtiö, L Discovery of potent and selective nonplanar tankyrase inhibiting nicotinamide mimics. Bioorg Med Chem23:4139-49 (2015) 
 
Protein mono-ADP-ribosyltransferase PARP10
Name:Protein mono-ADP-ribosyltransferase PARP10
Type:n/a
Mol. Mass.:109953.63
Organism:Homo sapiens (Human)
Description:Q53GL7
Residue:1025
BDBM50104288
NameBDBM50104288
Synonyms:CHEMBL3594137
TypeSmall organic molecule
Emp. Form.C18H20N2O
Mol. Mass.280.3642
SMILESCC(C)(C)c1ccc(cc1)C1NC(=O)c2ccccc2N1