Reaction Details
TargetPoly [ADP-ribose] polymerase tankyrase-2
LigandBDBM50104286
Substrate/Competitorn/a
Meas. Tech.ChEMBL_1505392 (CHEMBL3595275)
IC50 71±n/a nM
Citation Nkizinkiko, YSuneel Kumar, BVJeankumar, VUHaikarainen, TKoivunen, JMadhuri, CYogeeswari, PVenkannagari, HObaji, EPihlajaniemi, TSriram, DLehtiö, L Discovery of potent and selective nonplanar tankyrase inhibiting nicotinamide mimics. Bioorg Med Chem23:4139-49 (2015) 
 
Poly [ADP-ribose] polymerase tankyrase-2
Name:Poly [ADP-ribose] polymerase tankyrase-2
Type:Enzyme
Mol. Mass.:126937.16
Organism:Homo sapiens (Human)
Description:Q9H2K2
Residue:1166
BDBM50104286
NameBDBM50104286
Synonyms:CHEMBL3593715
TypeSmall organic molecule
Emp. Form.C18H23N5O
Mol. Mass.325.4081
SMILESO=c1[nH]c(nc2CCCCc12)N1CCN(Cc2ccncc2)CC1