Reaction Details
TargetPoly [ADP-ribose] polymerase 2
LigandBDBM50104285
Substrate/Competitorn/a
Meas. Tech.ChEMBL_1505399 (CHEMBL3595282)
IC50 3600±n/a nM
Citation Nkizinkiko, YSuneel Kumar, BVJeankumar, VUHaikarainen, TKoivunen, JMadhuri, CYogeeswari, PVenkannagari, HObaji, EPihlajaniemi, TSriram, DLehtiö, L Discovery of potent and selective nonplanar tankyrase inhibiting nicotinamide mimics. Bioorg Med Chem23:4139-49 (2015) 
 
Poly [ADP-ribose] polymerase 2
Name:Poly [ADP-ribose] polymerase 2
Type:Enzyme
Mol. Mass.:66225.70
Organism:Homo sapiens (Human)
Description:Q9UGN5
Residue:583
BDBM50104285
NameBDBM50104285
Synonyms:CHEMBL3593716
TypeSmall organic molecule
Emp. Form.C13H20N4O
Mol. Mass.248.3241
SMILESCN1CCN(CC1)c1nc2CCCCc2c(=O)[nH]1