Reaction Details
TargetPoly [ADP-ribose] polymerase 2
LigandBDBM50104286
Substrate/Competitorn/a
Meas. Tech.ChEMBL_1505399 (CHEMBL3595282)
IC50 4200±n/a nM
Citation Nkizinkiko, YSuneel Kumar, BVJeankumar, VUHaikarainen, TKoivunen, JMadhuri, CYogeeswari, PVenkannagari, HObaji, EPihlajaniemi, TSriram, DLehtiö, L Discovery of potent and selective nonplanar tankyrase inhibiting nicotinamide mimics. Bioorg Med Chem23:4139-49 (2015) 
 
Poly [ADP-ribose] polymerase 2
Name:Poly [ADP-ribose] polymerase 2
Type:Enzyme
Mol. Mass.:66225.70
Organism:Homo sapiens (Human)
Description:Q9UGN5
Residue:583
BDBM50104286
NameBDBM50104286
Synonyms:CHEMBL3593715
TypeSmall organic molecule
Emp. Form.C18H23N5O
Mol. Mass.325.4081
SMILESO=c1[nH]c(nc2CCCCc12)N1CCN(Cc2ccncc2)CC1