Reaction Details
TargetPoly [ADP-ribose] polymerase 1
LigandBDBM50104288
Substrate/Competitorn/a
Meas. Tech.ChEMBL_1505398 (CHEMBL3595281)
IC50>100000±n/a nM
Citation Nkizinkiko, YSuneel Kumar, BVJeankumar, VUHaikarainen, TKoivunen, JMadhuri, CYogeeswari, PVenkannagari, HObaji, EPihlajaniemi, TSriram, DLehtiö, L Discovery of potent and selective nonplanar tankyrase inhibiting nicotinamide mimics. Bioorg Med Chem23:4139-49 (2015) 
 
Poly [ADP-ribose] polymerase 1
Name:Poly [ADP-ribose] polymerase 1
Type:n/a
Mol. Mass.:113114.22
Organism:Homo sapiens (Human)
Description:P09874
Residue:1014
BDBM50104288
NameBDBM50104288
Synonyms:CHEMBL3594137
TypeSmall organic molecule
Emp. Form.C18H20N2O
Mol. Mass.280.3642
SMILESCC(C)(C)c1ccc(cc1)C1NC(=O)c2ccccc2N1