Reaction Details
TargetPoly [ADP-ribose] polymerase tankyrase-2
LigandBDBM50104290
Substrate/Competitorn/a
Meas. Tech.ChEMBL_1505392 (CHEMBL3595275)
IC50 360±n/a nM
Citation Nkizinkiko, YSuneel Kumar, BVJeankumar, VUHaikarainen, TKoivunen, JMadhuri, CYogeeswari, PVenkannagari, HObaji, EPihlajaniemi, TSriram, DLehtiö, L Discovery of potent and selective nonplanar tankyrase inhibiting nicotinamide mimics. Bioorg Med Chem23:4139-49 (2015) 
 
Poly [ADP-ribose] polymerase tankyrase-2
Name:Poly [ADP-ribose] polymerase tankyrase-2
Type:Enzyme
Mol. Mass.:126937.16
Organism:Homo sapiens (Human)
Description:Q9H2K2
Residue:1166
BDBM50104290
NameBDBM50104290
Synonyms:CHEMBL268379
TypeSmall organic molecule
Emp. Form.C16H17N3O
Mol. Mass.267.3257
SMILESCC(C)c1ccc(cc1)C1NC(=O)c2cccnc2N1