Reaction Details
TargetPoly [ADP-ribose] polymerase tankyrase-2
LigandBDBM50104293
Substrate/Competitorn/a
Meas. Tech.ChEMBL_1505392 (CHEMBL3595275)
IC50 580±n/a nM
Citation Nkizinkiko, YSuneel Kumar, BVJeankumar, VUHaikarainen, TKoivunen, JMadhuri, CYogeeswari, PVenkannagari, HObaji, EPihlajaniemi, TSriram, DLehtiö, L Discovery of potent and selective nonplanar tankyrase inhibiting nicotinamide mimics. Bioorg Med Chem23:4139-49 (2015) 
 
Poly [ADP-ribose] polymerase tankyrase-2
Name:Poly [ADP-ribose] polymerase tankyrase-2
Type:Enzyme
Mol. Mass.:126937.16
Organism:Homo sapiens (Human)
Description:Q9H2K2
Residue:1166
BDBM50104293
NameBDBM50104293
Synonyms:CHEMBL3594132
TypeSmall organic molecule
Emp. Form.C21H18N2O2
Mol. Mass.330.3798
SMILESO=C1NC(Nc2ccccc12)c1ccccc1OCc1ccccc1