Reaction Details
TargetPoly [ADP-ribose] polymerase tankyrase-2
LigandBDBM150782
Substrate/Competitorn/a
Meas. Tech.ChEMBL_1505392 (CHEMBL3595275)
IC50 417±n/a nM
Citation Nkizinkiko, YSuneel Kumar, BVJeankumar, VUHaikarainen, TKoivunen, JMadhuri, CYogeeswari, PVenkannagari, HObaji, EPihlajaniemi, TSriram, DLehtiö, L Discovery of potent and selective nonplanar tankyrase inhibiting nicotinamide mimics. Bioorg Med Chem23:4139-49 (2015) 
 
Poly [ADP-ribose] polymerase tankyrase-2
Name:Poly [ADP-ribose] polymerase tankyrase-2
Type:Enzyme
Mol. Mass.:126937.16
Organism:Homo sapiens (Human)
Description:Q9H2K2
Residue:1166
BDBM150782
NameBDBM150782
Synonyms:2-(4-Chlorophenyl)-2,3-dihydroquinazolin-4(1H)-one (1e)
TypeSmall organic molecule
Emp. Form.C14H11ClN2O
Mol. Mass.258.703
SMILESClc1ccc(cc1)C1NC(=O)c2ccccc2N1