Reaction Details
Target5-hydroxytryptamine receptor 2C
LigandBDBM50104925
Substrate/Competitorn/a
Meas. Tech.ChEMBL_1506485 (CHEMBL3599951)
Ki 3.8±n/a nM
Citation Boateng, CABakare, OMZhan, JBanala, AKBurzynski, CPommier, EKeck, TMDonthamsetti, PJavitch, JARais, RSlusher, BSXi, ZXNewman, AH High Affinity Dopamine D3 Receptor (D3R)-Selective Antagonists Attenuate Heroin Self-Administration in Wild-Type but not D3R Knockout Mice. J Med Chem58:6195-213 (2015) 
 
5-hydroxytryptamine receptor 2C
Name:5-hydroxytryptamine receptor 2C
Type:G Protein-Coupled Receptor (GPCR)
Mol. Mass.:51836.79
Organism:Homo sapiens (Human)
Description:P28335
Residue:458
BDBM50104925
NameBDBM50104925
Synonyms:CHEMBL3597635
TypeSmall organic molecule
Emp. Form.C28H30N4O
Mol. Mass.438.564
SMILESO=C(NCCCCN1CCN(CC1)c1cccc2ccccc12)c1cnc2ccccc2c1