Reaction Details
TargetD(2) dopamine receptor
LigandBDBM50105024
Substrate/Competitorn/a
Meas. Tech.ChEMBL_1506474 (CHEMBL3599873)
Ki 68±n/a nM
Citation Boateng, CABakare, OMZhan, JBanala, AKBurzynski, CPommier, EKeck, TMDonthamsetti, PJavitch, JARais, RSlusher, BSXi, ZXNewman, AH High Affinity Dopamine D3 Receptor (D3R)-Selective Antagonists Attenuate Heroin Self-Administration in Wild-Type but not D3R Knockout Mice. J Med Chem58:6195-213 (2015) 
 
D(2) dopamine receptor
Name:D(2) dopamine receptor
Type:Cell-surface receptors
Mol. Mass.:50647.10
Organism:Homo sapiens (Human)
Description:P14416
Residue:443
BDBM50105024
NameBDBM50105024
Synonyms:CHEMBL3597647
TypeSmall organic molecule
Emp. Form.C25H29FN4O2
Mol. Mass.436.5218
SMILESCOc1ccccc1N1CCN(CCCCNC(=O)c2ccc3cc(F)ccc3n2)CC1