Reaction Details
TargetD(3) dopamine receptor
LigandBDBM50105013
Substrate/Competitorn/a
Meas. Tech.ChEMBL_1506475 (CHEMBL3599874)
Ki 98±n/a nM
Citation Boateng, CABakare, OMZhan, JBanala, AKBurzynski, CPommier, EKeck, TMDonthamsetti, PJavitch, JARais, RSlusher, BSXi, ZXNewman, AH High Affinity Dopamine D3 Receptor (D3R)-Selective Antagonists Attenuate Heroin Self-Administration in Wild-Type but not D3R Knockout Mice. J Med Chem58:6195-213 (2015) 
 
D(3) dopamine receptor
Name:D(3) dopamine receptor
Type:n/a
Mol. Mass.:44243.43
Organism:Homo sapiens (Human)
Description:n/a
Residue:400
BDBM50105013
NameBDBM50105013
Synonyms:CHEMBL3597646
TypeSmall organic molecule
Emp. Form.C25H30N4O3
Mol. Mass.434.5307
SMILESCOc1ccccc1N1CCN(CC(O)CCNC(=O)c2ccc3ccccc3n2)CC1