Reaction Details
TargetD(3) dopamine receptor
LigandBDBM50104925
Substrate/Competitorn/a
Meas. Tech.ChEMBL_1506475 (CHEMBL3599874)
Ki 0.351000±n/a nM
Citation Boateng, CABakare, OMZhan, JBanala, AKBurzynski, CPommier, EKeck, TMDonthamsetti, PJavitch, JARais, RSlusher, BSXi, ZXNewman, AH High Affinity Dopamine D3 Receptor (D3R)-Selective Antagonists Attenuate Heroin Self-Administration in Wild-Type but not D3R Knockout Mice. J Med Chem58:6195-213 (2015) 
 
D(3) dopamine receptor
Name:D(3) dopamine receptor
Type:n/a
Mol. Mass.:44243.43
Organism:Homo sapiens (Human)
Description:n/a
Residue:400
BDBM50104925
NameBDBM50104925
Synonyms:CHEMBL3597635
TypeSmall organic molecule
Emp. Form.C28H30N4O
Mol. Mass.438.564
SMILESO=C(NCCCCN1CCN(CC1)c1cccc2ccccc12)c1cnc2ccccc2c1