Reaction Details
TargetHistone deacetylase 2
LigandBDBM50123957
Substrate/Competitorn/a
Meas. Tech.ChEMBL_1506754 (CHEMBL3598913)
Ki 0.100000±n/a nM
Citation Carrillo, AKGuiguemde, WAGuy, RK Evaluation of histone deacetylase inhibitors (HDACi) as therapeutic leads for human African trypanosomiasis (HAT). Bioorg Med Chem23:5151-5 (2015) 
 
Histone deacetylase 2
Name:Histone deacetylase 2
Type:Chromatin regulator; hydrolase; repressor
Mol. Mass.:55356.54
Organism:Homo sapiens (Human)
Description:Q92769
Residue:488
BDBM50123957
NameBDBM50123957
Synonyms:(E)-5-(3-Benzenesulfonylamino-phenyl)-pent-2-en-4-ynoic acid hydroxyamide 5-(4-Benzenesulfonylamino-phenyl)-pent-2-en-4-ynoic acid hydroxyamide Oxamflatin
TypeSmall organic molecule
Emp. Form.C17H14N2O4S
Mol. Mass.342.369
SMILESONC(=O)\C=C\C#Cc1ccc(NS(=O)(=O)c2ccccc2)cc1