Reaction Details
TargetHistone deacetylase 1
LigandBDBM50380399
Substrate/Competitorn/a
Meas. Tech.ChEMBL_1506753 (CHEMBL3598912)
Ki 3823±n/a nM
Citation Carrillo, AKGuiguemde, WAGuy, RK Evaluation of histone deacetylase inhibitors (HDACi) as therapeutic leads for human African trypanosomiasis (HAT). Bioorg Med Chem23:5151-5 (2015) 
 
Histone deacetylase 1
Name:Histone deacetylase 1
Type:Enzyme
Mol. Mass.:55090.27
Organism:Homo sapiens (Human)
Description:Q13547
Residue:482
BDBM50380399
NameBDBM50380399
Synonyms:CHEMBL2018302 US10227295, Compound Tubastatin A US11207431, Example D US9249087, Tubacin US9956192, Compound Tubastatin-A
TypeSmall organic molecule
Emp. Form.C20H21N3O2
Mol. Mass.335.3996
SMILESCN1CCc2c(C1)c1ccccc1n2Cc1ccc(cc1)C(=O)NO