Reaction Details
TargetHistone deacetylase 1
LigandBDBM50105327
Substrate/Competitorn/a
Meas. Tech.ChEMBL_1506753 (CHEMBL3598912)
Ki 0.030±n/a nM
Citation Carrillo, AKGuiguemde, WAGuy, RK Evaluation of histone deacetylase inhibitors (HDACi) as therapeutic leads for human African trypanosomiasis (HAT). Bioorg Med Chem23:5151-5 (2015) 
 
Histone deacetylase 1
Name:Histone deacetylase 1
Type:Enzyme
Mol. Mass.:55090.27
Organism:Homo sapiens (Human)
Description:Q13547
Residue:482
BDBM50105327
NameBDBM50105327
Synonyms:JNJ-26481585 | Quisinostat
TypeSmall organic molecule
Emp. Form.C21H26N6O2
Mol. Mass.394.4701
SMILESCn1cc(CNCC2CCN(CC2)c2ncc(cn2)C(=O)NO)c2ccccc12