Reaction Details
TargetHistone deacetylase 8
LigandBDBM50105329
Substrate/Competitorn/a
Meas. Tech.ChEMBL_1506756 (CHEMBL3598915)
Ki 39±n/a nM
Citation Carrillo, AKGuiguemde, WAGuy, RK Evaluation of histone deacetylase inhibitors (HDACi) as therapeutic leads for human African trypanosomiasis (HAT). Bioorg Med Chem23:5151-5 (2015) 
 
Histone deacetylase 8
Name:Histone deacetylase 8
Type:Enzyme
Mol. Mass.:41749.60
Organism:Homo sapiens (Human)
Description:Q9BY41
Residue:377
BDBM50105329
NameBDBM50105329
Synonyms:CHEMBL1213492
TypeSmall organic molecule
Emp. Form.C24H27N3O4
Mol. Mass.421.4889
SMILESCCN(CC)Cc1ccc2cc(COC(=O)Nc3ccc(cc3)C(=O)NO)ccc2c1