Reaction Details
TargetHistone deacetylase 4
LigandBDBM50105329
Substrate/Competitorn/a
Meas. Tech.ChEMBL_1506757 (CHEMBL3598916)
Ki 1050±n/a nM
Citation Carrillo, AKGuiguemde, WAGuy, RK Evaluation of histone deacetylase inhibitors (HDACi) as therapeutic leads for human African trypanosomiasis (HAT). Bioorg Med Chem23:5151-5 (2015) 
 
Histone deacetylase 4
Name:Histone deacetylase 4
Type:Enzyme
Mol. Mass.:119049.39
Organism:Homo sapiens (Human)
Description:P56524
Residue:1084
BDBM50105329
NameBDBM50105329
Synonyms:CHEMBL1213492
TypeSmall organic molecule
Emp. Form.C24H27N3O4
Mol. Mass.421.4889
SMILESCCN(CC)Cc1ccc2cc(COC(=O)Nc3ccc(cc3)C(=O)NO)ccc2c1