Reaction Details
TargetHistone deacetylase 5
LigandBDBM50105330
Substrate/Competitorn/a
Meas. Tech.ChEMBL_1506758 (CHEMBL3598917)
Ki 21±n/a nM
Citation Carrillo, AKGuiguemde, WAGuy, RK Evaluation of histone deacetylase inhibitors (HDACi) as therapeutic leads for human African trypanosomiasis (HAT). Bioorg Med Chem23:5151-5 (2015) 
 
Histone deacetylase 5
Name:Histone deacetylase 5
Type:Enzyme
Mol. Mass.:121968.61
Organism:Homo sapiens (Human)
Description:Q9UQL6
Residue:1122
BDBM50105330
NameBDBM50105330
Synonyms:CHEMBL1851943
TypeSmall organic molecule
Emp. Form.C20H30N4O2
Mol. Mass.358.4778
SMILESCCCCc1nc2cc(\C=C\C(=O)NO)ccc2n1CCN(CC)CC