Reaction Details
TargetHistone deacetylase 9
LigandBDBM50105327
Substrate/Competitorn/a
Meas. Tech.ChEMBL_1506760 (CHEMBL3598919)
Ki 3.8±n/a nM
Citation Carrillo, AKGuiguemde, WAGuy, RK Evaluation of histone deacetylase inhibitors (HDACi) as therapeutic leads for human African trypanosomiasis (HAT). Bioorg Med Chem23:5151-5 (2015) 
 
Histone deacetylase 9
Name:Histone deacetylase 9
Type:Enzyme
Mol. Mass.:111304.31
Organism:Homo sapiens (Human)
Description:Q9UKV0
Residue:1011
BDBM50105327
NameBDBM50105327
Synonyms:JNJ-26481585 | Quisinostat
TypeSmall organic molecule
Emp. Form.C21H26N6O2
Mol. Mass.394.4701
SMILESCn1cc(CNCC2CCN(CC2)c2ncc(cn2)C(=O)NO)c2ccccc12