Reaction Details
TargetHistone deacetylase 9
LigandBDBM29589
Substrate/Competitorn/a
Meas. Tech.ChEMBL_1506760 (CHEMBL3598919)
Ki 3200±n/a nM
Citation Carrillo, AKGuiguemde, WAGuy, RK Evaluation of histone deacetylase inhibitors (HDACi) as therapeutic leads for human African trypanosomiasis (HAT). Bioorg Med Chem23:5151-5 (2015) 
 
Histone deacetylase 9
Name:Histone deacetylase 9
Type:Enzyme
Mol. Mass.:111304.31
Organism:Homo sapiens (Human)
Description:Q9UKV0
Residue:1011
BDBM29589
NameBDBM29589
Synonyms:Faridak LBH-589B US10722597, Compound Panobinostat
TypeSmall organic molecule
Emp. Form.C21H23N3O2
Mol. Mass.349.4262
SMILESCc1[nH]c2ccccc2c1CCNCc1ccc(\C=C\C(=O)NO)cc1