Reaction Details
TargetHistone deacetylase 6
LigandBDBM19428
Substrate/Competitorn/a
Meas. Tech.ChEMBL_1506761 (CHEMBL3598920)
Ki 9.5±n/a nM
Citation Carrillo, AKGuiguemde, WAGuy, RK Evaluation of histone deacetylase inhibitors (HDACi) as therapeutic leads for human African trypanosomiasis (HAT). Bioorg Med Chem23:5151-5 (2015) 
 
Histone deacetylase 6
Name:Histone deacetylase 6
Type:Chromatin regulator; hydrolase; repressor
Mol. Mass.:131381.51
Organism:Homo sapiens (Human)
Description:Q9UBN7
Residue:1215
BDBM19428
NameBDBM19428
Synonyms:(2E)-N-hydroxy-3-(4-{[(2-hydroxyethyl)[2-(1H-indol-3-yl)ethyl]amino]methyl}phenyl)prop-2-enamide CHEMBL356066 LAQ-824 | NVP-LAQ824
TypeSmall organic molecule
Emp. Form.C22H25N3O3
Mol. Mass.379.4522
SMILESOCCN(CCc1c[nH]c2ccccc12)Cc1ccc(\C=C\C(=O)NO)cc1