Reaction Details
TargetMetabotropic glutamate receptor 1
LigandBDBM50105804
Substrate/Competitorn/a
Meas. Tech.ChEMBL_1507574 (CHEMBL3599916)
Ki>1000±n/a nM
Citation Anighoro, AGraziani, DBettinelli, ICilia, ADe Toma, CLonghi, MMangiarotti, FMenegon, SPirona, LPoggesi, ERiva, CRastelli, G Insights into the interaction of negative allosteric modulators with the metabotropic glutamate receptor 5: discovery and computational modeling of a new series of ligands with nanomolar affinity. Bioorg Med Chem23:3040-58 (2015) 
 
Metabotropic glutamate receptor 1
Name:Metabotropic glutamate receptor 1
Type:Enzyme Catalytic Domain
Mol. Mass.:133240.47
Organism:RAT
Description:metabotropic glutamate 1/2 0 RAT::P23385
Residue:1199
BDBM50105804
NameBDBM50105804
Synonyms:CHEMBL3597599
TypeSmall organic molecule
Emp. Form.C20H15ClN4O2
Mol. Mass.378.812
SMILES[#8-]-[#7+](=O)-c1cccnc1-[#7]-1-[#6]-[#6]\[#6](-[#6]-[#6]-1)=[#6]/C#Cc1cc(Cl)cc(c1)C#N