Reaction Details
TargetMetabotropic glutamate receptor 5
LigandBDBM50105840
Substrate/Competitorn/a
Meas. Tech.ChEMBL_1507571 (CHEMBL3599913)
Ki 117±n/a nM
Citation Anighoro, AGraziani, DBettinelli, ICilia, ADe Toma, CLonghi, MMangiarotti, FMenegon, SPirona, LPoggesi, ERiva, CRastelli, G Insights into the interaction of negative allosteric modulators with the metabotropic glutamate receptor 5: discovery and computational modeling of a new series of ligands with nanomolar affinity. Bioorg Med Chem23:3040-58 (2015) 
 
Metabotropic glutamate receptor 5
Name:Metabotropic glutamate receptor 5
Type:Enzyme
Mol. Mass.:131900.14
Organism:Rattus norvegicus (Rat)
Description:P31424
Residue:1203
BDBM50105840
NameBDBM50105840
Synonyms:CHEMBL3597591
TypeSmall organic molecule
Emp. Form.C18H18N4O2
Mol. Mass.322.3611
SMILES[O-][N+](=O)c1cccnc1N1CCN(CC#Cc2ccccc2)CC1