Reaction Details
TargetMetabotropic glutamate receptor 5
LigandBDBM50105831
Substrate/Competitorn/a
Meas. Tech.ChEMBL_1507573 (CHEMBL3599915)
IC50 0.900000±n/a nM
Citation Anighoro, AGraziani, DBettinelli, ICilia, ADe Toma, CLonghi, MMangiarotti, FMenegon, SPirona, LPoggesi, ERiva, CRastelli, G Insights into the interaction of negative allosteric modulators with the metabotropic glutamate receptor 5: discovery and computational modeling of a new series of ligands with nanomolar affinity. Bioorg Med Chem23:3040-58 (2015) 
 
Metabotropic glutamate receptor 5
Name:Metabotropic glutamate receptor 5
Type:Enzyme
Mol. Mass.:132484.72
Organism:Homo sapiens (Human)
Description:n/a
Residue:1212
BDBM50105831
NameBDBM50105831
Synonyms:CHEMBL3597584
TypeSmall organic molecule
Emp. Form.C18H16N4O3
Mol. Mass.336.3446
SMILES[O-][N+](=O)c1cccnc1N1CCN(CC1)C(=O)C#Cc1ccccc1