Reaction Details
TargetAdenosylhomocysteinase
LigandBDBM50050879
Substrate/Competitorn/a
Meas. Tech.ChEMBL_1507791 (CHEMBL3598548)
IC50 230±n/a nM
Citation Nakao, ASuzuki, HUeno, HIwasaki, HSetsuta, TKashima, ASunada, S Discovery and structural analyses of S-adenosyl-L-homocysteine hydrolase inhibitors based on non-adenosine analogs. Bioorg Med Chem23:4952-69 (2015) 
 
Adenosylhomocysteinase
Name:Adenosylhomocysteinase
Type:PROTEIN
Mol. Mass.:47714.06
Organism:Homo sapiens (Human)
Description:ChEMBL_1507791
Residue:432
BDBM50050879
NameBDBM50050879
Synonyms:CHEMBL3322545
TypeSmall organic molecule
Emp. Form.C29H39Cl2N5O5S
Mol. Mass.640.621
SMILESCN(C1CCN(CC1)S(C)(=O)=O)C(=O)CN(CC(=O)NCCN1CCCC1)c1cc(Cl)ccc1Oc1ccc(Cl)cc1