Reaction Details
TargetAdenosylhomocysteinase
LigandBDBM50050876
Substrate/Competitorn/a
Meas. Tech.ChEMBL_1507791 (CHEMBL3598548)
IC50 200±n/a nM
Citation Nakao, ASuzuki, HUeno, HIwasaki, HSetsuta, TKashima, ASunada, S Discovery and structural analyses of S-adenosyl-L-homocysteine hydrolase inhibitors based on non-adenosine analogs. Bioorg Med Chem23:4952-69 (2015) 
 
Adenosylhomocysteinase
Name:Adenosylhomocysteinase
Type:PROTEIN
Mol. Mass.:47714.06
Organism:Homo sapiens (Human)
Description:ChEMBL_1507791
Residue:432
BDBM50050876
NameBDBM50050876
Synonyms:CHEMBL3322548
TypeSmall organic molecule
Emp. Form.C32H37Cl2N5O3
Mol. Mass.610.574
SMILESCN(N1CCc2ccccc2C1)C(=O)CN(CC(=O)NCCN1CCCC1)c1cc(Cl)ccc1Oc1ccc(Cl)cc1