Reaction Details
TargetAdenosylhomocysteinase
LigandBDBM50050890
Substrate/Competitorn/a
Meas. Tech.ChEMBL_1507791 (CHEMBL3598548)
IC50 970±n/a nM
Citation Nakao, ASuzuki, HUeno, HIwasaki, HSetsuta, TKashima, ASunada, S Discovery and structural analyses of S-adenosyl-L-homocysteine hydrolase inhibitors based on non-adenosine analogs. Bioorg Med Chem23:4952-69 (2015) 
 
Adenosylhomocysteinase
Name:Adenosylhomocysteinase
Type:PROTEIN
Mol. Mass.:47714.06
Organism:Homo sapiens (Human)
Description:ChEMBL_1507791
Residue:432
BDBM50050890
NameBDBM50050890
Synonyms:CHEMBL3322535
TypeSmall organic molecule
Emp. Form.C33H38Cl2N4O3
Mol. Mass.609.586
SMILESClc1ccc(Oc2ccc(Cl)cc2N(CC(=O)NCCN2CCCC2)CC(=O)N2CCC(CC2)c2ccccc2)cc1