Reaction Details
TargetAdenosylhomocysteinase
LigandBDBM50050891
Substrate/Competitorn/a
Meas. Tech.ChEMBL_1507791 (CHEMBL3598548)
IC50 340±n/a nM
Citation Nakao, ASuzuki, HUeno, HIwasaki, HSetsuta, TKashima, ASunada, S Discovery and structural analyses of S-adenosyl-L-homocysteine hydrolase inhibitors based on non-adenosine analogs. Bioorg Med Chem23:4952-69 (2015) 
 
Adenosylhomocysteinase
Name:Adenosylhomocysteinase
Type:PROTEIN
Mol. Mass.:47714.06
Organism:Homo sapiens (Human)
Description:ChEMBL_1507791
Residue:432
BDBM50050891
NameBDBM50050891
Synonyms:CHEMBL3322534
TypeSmall organic molecule
Emp. Form.C31H36Cl2N4O3
Mol. Mass.583.549
SMILESCN(CCc1ccccc1)C(=O)CN(CC(=O)NCCN1CCCC1)c1cc(Cl)ccc1Oc1ccc(Cl)cc1